{"text_format":"1","workbook":"xlsx","n_sheets":5,"sheets":["Рекомендации","Ипостасные","Здание","Этажи","справочники"],"not_rendered":{"charts":0,"images":3,"macros":1,"external_links":0,"defined_names":30,"comments":0,"pivot_tables":0},"unopened":[],"bounds":{"document_bytes":16777216,"sheet_cells":100000,"rows_first":2000,"rows_last":500,"rows_between":2000,"halvings":0,"cell_chars":16384,"cell_head_chars":4096},"cells_cut":0,"cells_raw":0,"read":"whole","date_system":"1900"}

{"sheet":"Рекомендации","index":0,"n_rows":50,"n_cols":1,"rows_kept":50,"cut":false,"hidden":false,"merged":[]}
["Методические рекомендации Главам МАИ и Главам подразделений ИВДИВО для применения Книги подразделения ИВДИВО"]
[]
["Утверждаю. КХ 21.12.2016"]
["Редакция Книги 21 декабря 2016 г."]
[]
["Данная Книга является инструментом подразделения ИВДИВО и обязательна для применения."]
[]
["Книга содержит программы, при ее открытии Excel может запросить разрешения. Разрешайте, чтобы включить весь функционал этого инструмента вашего Служения. Если что-то не работает, значит вы не включили в Excel содержание Книги при ее открытии или у вас настолько старый Excel, что он не понимает применённый язык программирования."]
[]
["Применение Книги начинается с указания ее базовых параметров на листе \"Ипостасные\":"]
["1. В ячейку D2 введите номер Изначальности вашего подразделения."]
["2. Выберите вид состава вашего подразделения."]
["Настройка Книги на этом завершена. Можно вводить данные всех Советов и Составов подразделения и филиалов."]
["Идея в том, что именно в этой Книге должны содержаться данные столпа и контакты Ипостасных вашего подразделения. В контактах обязательно указывайте адрес электронной почты и номер телефона в международном формате."]
["Последовательность действий:"]
["1. На листе \"Ипостасные\" выбираем один из 16 составов и вводим Основной состав подразделения."]
["2. Вводим филиалы с Домами Отца. Ипостасей и Служащих филиала с ДО необходимо ввести до ввода Синтезного состава, т.к. в столпе места этих Ипостасных филиалов чётко регламентированы и не могут быть заняты Синтезным составом. Для ввода филиалов с Домами Отца используйте кнопку «Добавить Дом Отца филиала». После каждого нажатия кнопки вводите ФИО Ипостасных филиала."]
["3. Вручную вводим Синтезный состав подразделения, последовательно заполняя вакансии Синтезного состава сверху вниз. Распределение Синтезного состава по Организациям и Домам Отца не регламентировано. Служащие сами набирают Синтезный состав в свои команды и руководят им."]
["4. Вводим Синтезный состав Домов Отца филиалов, последовательно заполняя вакансии Синтезного состава сверху вниз. Данная операция не автоматизирована, но проста в ручном исполнении: в окончании звания Ипостасного дописывайте: [филиал <название территории>]"]
["5. Вводим филиалы до трёх Ипостасных, последовательно заполняя вакансии Синтезного состава сверху вниз. Используйте кнопку «Добавить филиал до 3 Служащих». После каждого нажатия кнопки вводите ФИО Ипостасных филиала."]
{"$rows_left_out":31}
{"sheet":"Ипостасные","index":1,"n_rows":274,"n_cols":18,"rows_kept":274,"cut":false,"hidden":false,"merged":[[8,0,8,2],[1,0,1,2]]}
[16,null,null,"Данные вводятся только в ячейки серого цвета!"]
[{"$f":"\"Книга подразделения ИВДИВО «\"&IFERROR(INDEX(справочники!L2:L17,A1),\"такого подразделения нет\")&\"».\"","v":"Книга подразделения ИВДИВО «16 Состав: 128 Служащих»."},null,null,512]
[null,null,"Наименование подразделения в родительном падеже:",{"$f":"IFERROR(INDEX(Название_подразделения_рп,MATCH(Изначальность,Номер_Изначальности,0)),\"такого подразделения нет\")","v":"Изначально Вышестоящий Дом ИВО"},{"$f":"IF(OR(Изначальность>512,Изначальность<0),\"такого подразделения нет\",\" Изначальности\")","v":" Изначальности"},{"$f":"IFERROR(INDEX(Название_Подразделения,MATCH(Изначальность,Номер_Изначальности,0)),\"такого подразделения нет\")","v":"Изначально Вышестоящий Дом ИВО"}]
[null,null,"Управление Синтеза",{"$f":"IFERROR(INDEX(_256рица_Синтеза_ИВО,MATCH(Изначальность,Номер_Изначальности,0)),\"такого подразделения нет\")","v":"Изначально Вышестоящий Дом ИВО"},{"$f":"IFERROR(INDEX(Отделения,MATCH(Изначальность,Номер_Изначальности,0)),\" нет\")","v":"Р"}]
[null,null,"Территория (именительный падеж):",{"$f":"IFERROR(IF(D9=1,INDEX(Территория_,MATCH(Изначальность,Номер_Изначальности,0)),INDEX(Территория_,MATCH(Изначальность,Номер_Изначальности,0))),\" нет\")","v":"Москва"},{"$f":"IF(E4=\"Р\",\"Региональный\",\"Местный\")","v":"Региональный"}]
[null,null,"Территория (родительный падеж):",{"$f":"IFERROR(IF(D9=1,INDEX(Территории_,MATCH(D2,Номер_Изначальности,0)),INDEX(Территории_,MATCH(D2,Номер_Изначальности,0))),\" нет\")","v":"Москвы"},{"$f":"IF(E4=\"Р\",\"Регионального\",\"Местного\")","v":"Регионального"}]
[null,null,"Владыка",{"$f":"IFERROR(INDEX(ИВладыки_родит_падеж,513-Изначальность),\"такого Владыки нет\")","v":"Кут Хуми"}]
[null,null,"Владычица",{"$f":"IFERROR(INDEX(ИВладыки_родит_падеж,513+128-Изначальность),\"такого Владыки нет\")","v":"Фаинь"}]
[{"$f":"\"Мыслеобраз, Цель, Задача, Устремление ИВДИВО \"&Изначальность&\" Изначальности, \"&Территория&\":\"","v":"Мыслеобраз, Цель, Задача, Устремление ИВДИВО 512 Изначальности, Москва:"},null,null,255]
["Отцовскость ИВО Синтезностью Созидающей Мощью Основ ИВДИВО ИВО",null,null,{"$f":"\"Мыслеобраз \"&Наименование_Подразделения&\" \"&Изначальность&\" Изначальности\"","v":"Мыслеобраз Изначально Вышестоящий Дом ИВО 512 Изначальности"}]
["Синтезность концентрацией примененного Синтеза Иерархии 256И состоятельностью полномочий служащих синтезипостасно",null,null,{"$f":"\"Цель \"&Наименование_Подразделения&\" \"&Изначальность&\" Изначальности\"","v":"Цель Изначально Вышестоящий Дом ИВО 512 Изначальности"}]
["Идивные технологии явления физичности Основ ИВО Синтезом ИС ИВДИВО",null,null,{"$f":"\"Задача \"&Наименование_Подразделения&\" \"&Изначальность&\" Изначальности\"","v":"Задача Изначально Вышестоящий Дом ИВО 512 Изначальности"}]
["Наработать 64ую процессуальность 256 Части ИВО",null,null,{"$f":"\"Устремление \"&Наименование_Подразделения&\" \"&Изначальность&\" Изначальности\"","v":"Устремление Изначально Вышестоящий Дом ИВО 512 Изначальности"}]
[]
["Совет Изначально Вышестоящего Отца:",null,null,"ФИО","E-mail","Тел.1","Тел.2","WhatsApp","Viber","Город","Служащий Синтеза","Поручения","Личные стяжания","Статус","Мыслеобраз","Цель","Задача","Устремление"]
[null,1,{"$f":"\"Аватар Синтез Синтеза ИВО, Глава ИВДИВО \"&Изначальность&\" Изначальности, Управления Синтеза Кут Хуми\"","v":"Аватар Синтез Синтеза ИВО, Глава ИВДИВО 512 Изначальности, Управления Синтеза Кут Хуми"}]
[null,2,{"$f":"\"Владыка Синтез Синтеза Изначально Вышестоящего \"&IFERROR(INDEX(_256_ИВО,513-Изначальность),\"ошибка\")&\", Глава Высшей Школы Синтеза \"&Изначальность&\" Изначальности, Управления Синтеза Иосифа\"","v":"Владыка Синтез Синтеза Изначально Вышестоящего Отца ИВО, Глава Высшей Школы Синтеза 512 Изначальности, Управления Синтеза Иосифа"}]
[null,3,{"$f":"\"Владыка Синтез Синтеза Изначального Владыки Кут Хуми, Глава Изначально Метагалактической Академии Наук \"&Территории&\", Управления Синтеза Мории\"","v":"Владыка Синтез Синтеза Изначального Владыки Кут Хуми, Глава Изначально Метагалактической Академии Наук Москвы, Управления Синтеза Мории"}]
[null,4,{"$f":"\"Владыка Синтез Синтеза Изначального Владыки \"&Владыка&\", Глава Изначального Центра Ипостаси Синтеза, Управления Синтеза Филиппа\"","v":"Владыка Синтез Синтеза Изначального Владыки Кут Хуми, Глава Изначального Центра Ипостаси Синтеза, Управления Синтеза Филиппа"}]
[null,5,{"$f":"\"Владыка Синтез Синтеза ИВО, Глава Метагалактической Гражданской Конфедерации \"&Территории&\", Управления Синтеза Византия\"","v":"Владыка Синтез Синтеза ИВО, Глава Метагалактической Гражданской Конфедерации Москвы, Управления Синтеза Византия"}]
{"$rows_left_out":255}
{"sheet":"Здание","index":2,"n_rows":261,"n_cols":4,"rows_kept":261,"cut":false,"hidden":false,"merged":[[4,2,4,3],[0,2,0,3]]}
[null,null,{"$f":"\"Здание \"&Наименование_Подразделения&\" \"&Изначальность&\" Изначальности, \"&Территория &\"\nна 1 вышестоящем Присутствии \" &Изначальность & \" Изначальности\"","v":"Здание Изначально Вышестоящий Дом ИВО 512 Изначальности, Москва\nна 1 вышестоящем Присутствии 512 Изначальности"}]
[]
[null,null,"Залы Иерархов ИВДИВО","Залы и кабинеты Ипостасных в Здании"]
[]
[null,null,"Зал Изначально Вышестоящего Отца"]
[256,null,{"$f":"\"Зал и кабинет \"&справочники!R2&\"\nЗал и кабинет Изначального Владыки ИВО \"&справочники!K2","v":"Зал и кабинет  ИВ Отец ИВО \nЗал и кабинет Изначального Владыки ИВО Кут Хуми"},{"$f":"IF(Ипостасные!D16=\"\",\"\", \"Зал и кабинет \"&Ипостасные!C16&\" \"&Ипостасные!D16)&\"\nЗал Совета ИВО\nЗал Совета ИВДИВО\"","v":"\nЗал Совета ИВО\nЗал Совета ИВДИВО"}]
[255,null,{"$f":"\"Зал и кабинет \"&справочники!R3&\"\nЗал и кабинет Изначального Владыки ИВО \"&справочники!K3","v":"Зал и кабинет  ИВ Аватар ИВО \nЗал и кабинет Изначального Владыки ИВО Иосифа"},{"$f":"IF(Ипостасные!D17=\"\",\"\", \"Зал и кабинет \"&Ипостасные!C17&\" \"&Ипостасные!D17)","v":""}]
[254,null,{"$f":"\"Зал и кабинет \"&справочники!R4&\"\nЗал и кабинет Изначального Владыки ИВО \"&справочники!K4","v":"Зал и кабинет  ИВ Владыка ИВ \nЗал и кабинет Изначального Владыки ИВО Мории"},{"$f":"IF(Ипостасные!D18=\"\",\"\", \"Зал и кабинет \"&Ипостасные!C18&\" \"&Ипостасные!D18)","v":""}]
[253,null,{"$f":"\"Зал и кабинет \"&справочники!R5&\"\nЗал и кабинет Изначального Владыки ИВО \"&справочники!K5","v":"Зал и кабинет  ИВ Учитель ИВО \nЗал и кабинет Изначального Владыки ИВО Филиппа"},{"$f":"IF(Ипостасные!D19=\"\",\"\", \"Зал и кабинет \"&Ипостасные!C19&\" \"&Ипостасные!D19)","v":""}]
[252,null,{"$f":"\"Зал и кабинет \"&справочники!R6&\"\nЗал и кабинет Изначального Владыки ИВО \"&справочники!K6","v":"Зал и кабинет  ИВ Ипостась ИВО \nЗал и кабинет Изначального Владыки ИВО Византия"},{"$f":"IF(Ипостасные!D20=\"\",\"\", \"Зал и кабинет \"&Ипостасные!C20&\" \"&Ипостасные!D20)","v":""}]
[251,null,{"$f":"\"Зал и кабинет \"&справочники!R7&\"\nЗал и кабинет Изначального Владыки ИВО \"&справочники!K7","v":"Зал и кабинет  ИВ Ипостась ИВ Служащий ИВО \nЗал и кабинет Изначального Владыки ИВО Янова"},{"$f":"IF(Ипостасные!D21=\"\",\"\", \"Зал и кабинет \"&Ипостасные!C21&\" \"&Ипостасные!D21)","v":""}]
[250,null,{"$f":"\"Зал и кабинет \"&справочники!R8&\"\nЗал и кабинет Изначального Владыки ИВО \"&справочники!K8","v":"Зал и кабинет  ИВ Ипостась ИВ Посвящённый ИВО \nЗал и кабинет Изначального Владыки ИВО Юлия"},{"$f":"IF(Ипостасные!D22=\"\",\"\", \"Зал и кабинет \"&Ипостасные!C22&\" \"&Ипостасные!D22)","v":""}]
[249,null,{"$f":"\"Зал и кабинет \"&справочники!R9&\"\nЗал и кабинет Изначального Владыки ИВО \"&справочники!K9","v":"Зал и кабинет  ИВ Ипостась ИВ Майтрейя ИВО \nЗал и кабинет Изначального Владыки ИВО Юсефа"},{"$f":"IF(Ипостасные!D23=\"\",\"\", \"Зал и кабинет \"&Ипостасные!C23&\" \"&Ипостасные!D23)","v":""}]
[248,null,{"$f":"\"Зал и кабинет \"&справочники!R10&\"\nЗал и кабинет Изначального Владыки ИВО \"&справочники!K10","v":"Зал и кабинет  ИВ Ипостась ИВ Христос ИВО \nЗал и кабинет Изначального Владыки ИВО Владомира"},{"$f":"IF(Ипостасные!D24=\"\",\"\", \"Зал и кабинет \"&Ипостасные!C24&\" \"&Ипостасные!D24)","v":""}]
[247,null,{"$f":"\"Зал и кабинет \"&справочники!R11&\"\nЗал и кабинет Изначального Владыки ИВО \"&справочники!K11","v":"Зал и кабинет  ИВ Ипостась ИВ Будда ИВО \nЗал и кабинет Изначального Владыки ИВО Саввы"},{"$f":"IF(Ипостасные!D26=\"\",\"\", \"Зал и кабинет \"&Ипостасные!C26&\" \"&Ипостасные!D26)","v":""}]
[246,null,{"$f":"\"Зал и кабинет \"&справочники!R12&\"\nЗал и кабинет Изначального Владыки ИВО \"&справочники!K12","v":"Зал и кабинет  ИВ Ипостась ИВ Теург ИВО \nЗал и кабинет Изначального Владыки ИВО Савелия"},{"$f":"IF(Ипостасные!D27=\"\",\"\", \"Зал и кабинет \"&Ипостасные!C27&\" \"&Ипостасные!D27)","v":""}]
[245,null,{"$f":"\"Зал и кабинет \"&справочники!R13&\"\nЗал и кабинет Изначального Владыки ИВО \"&справочники!K13","v":"Зал и кабинет  ИВ Ипостась ИВ Творец ИВО \nЗал и кабинет Изначального Владыки ИВО Вильгельма"},{"$f":"IF(Ипостасные!D28=\"\",\"\", \"Зал и кабинет \"&Ипостасные!C28&\" \"&Ипостасные!D28)","v":""}]
[244,null,{"$f":"\"Зал и кабинет \"&справочники!R14&\"\nЗал и кабинет Изначального Владыки ИВО \"&справочники!K14","v":"Зал и кабинет  ИВ Ипостась ИВ Аспект ИВО \nЗал и кабинет Изначального Владыки ИВО Юстаса"},{"$f":"IF(Ипостасные!D29=\"\",\"\", \"Зал и кабинет \"&Ипостасные!C29&\" \"&Ипостасные!D29)","v":""}]
[243,null,{"$f":"\"Зал и кабинет \"&справочники!R15&\"\nЗал и кабинет Изначального Владыки ИВО \"&справочники!K15","v":"Зал и кабинет  ИВ Ипостась ИВ Логос ИВО \nЗал и кабинет Изначального Владыки ИВО Александра"},{"$f":"IF(Ипостасные!D30=\"\",\"\", \"Зал и кабинет \"&Ипостасные!C30&\" \"&Ипостасные!D30)","v":""}]
[242,null,{"$f":"\"Зал и кабинет \"&справочники!R16&\"\nЗал и кабинет Изначального Владыки ИВО \"&справочники!K16","v":"Зал и кабинет  ИВ Ипостась ИВ Ману ИВО \nЗал и кабинет Изначального Владыки ИВО Яромира"},{"$f":"IF(Ипостасные!D31=\"\",\"\", \"Зал и кабинет \"&Ипостасные!C31&\" \"&Ипостасные!D31)","v":""}]
{"$rows_left_out":242}
{"sheet":"Этажи","index":3,"n_rows":4,"n_cols":1,"rows_kept":4,"cut":false,"hidden":false,"merged":[[0,0,0,1],[1,0,1,1],[18,0,18,1],[3,0,3,1]]}
[{"$f":"\"План здания \"&Наименование_Подразделения&\" \"&Изначальность&\" Изначальности, \"&Территория","v":"План здания Изначально Вышестоящий Дом ИВО 512 Изначальности, Москва"}]
["В плане здания распределены только Ипостасные ИВДИВО Основного и Синтезного состава. Служащие, Посвящённые и Полномочные приписаны к Ипостасным и составляют их группы явления в Залах."]
[]
["План 256-ти этажей:"]

{"sheet":"справочники","index":4,"n_rows":274,"n_cols":18,"rows_kept":274,"cut":false,"hidden":false,"merged":[]}
["№ Изн","территория","территории","Отделения","Название подразделения","Название подразделения в родительном падеже","128рица Синтеза ИВО","256-рица ИВО","256-рица ИВОв родительном падеже","ИВладыки","ИВладыки","Вид подразделения",{"$f":"\"Контакты Ипостасных подразделения \"&Наименование_Подразделения&\" \"&Изначальность&\" Изначальности\"&\", \"&Территория","v":"Контакты Ипостасных подразделения Изначально Вышестоящий Дом ИВО 512 Изначальности, Москва"},null,null,null,"128 частей","Кабинеты на этажах"]
[512,"Москва","Москвы","Р","Изначально Вышестоящий Дом ИВО","Изначально Вышестоящий Дом ИВО","Изначально Вышестоящий Дом ИВО"," ИВ Отец ИВО ","Отца ИВО","Кут Хуми   ","Кут Хуми","1 Состав: 16 Служащих","Фаинь",null,0,0," Отец ИВО                               "," ИВ Отец ИВО "]
[511,"Санкт-Петербург","Санкт-Петербурга","Р","Изначально Вышестоящая Иерархия ИВО","Изначально Вышестоящая Иерархия ИВО","Изначально Вышестоящая Иерархия ИВО"," ИВ Аватар ИВО ","Аватара ИВО","Иосиф","Иосифа","2 Состав: 22 Служащих","Славия","Наименование подразделения в родительном падеже:",null,null," Владыка ИВО                         "," ИВ Аватар ИВО "]
[510,"Новосибирск","Новосибирска","Р","Синтез Изначально Вышестоящего Человека ИВО","Синтез Изначально Вышестоящего Человека ИВО","Синтез Изначально Вышестоящего Человека ИВО"," ИВ Владыка ИВ ","Владыки ИВО","Мория","Мории","3 Состав: 27 Служащих","Свет","Управление Синтеза",null,null," Учитель ИВО                          "," ИВ Владыка ИВ "]
[509,"Крым","Крыма","Р","Синтез Изначально Метагалактической Цивилизации ИВО","Синтез Изначально Метагалактической Цивилизации ИВО","Синтез Изначально Метагалактической Цивилизации ИВО"," ИВ Учитель ИВО ","Учителя ИВО","Филипп","Филиппа","4 Состав: 33 Служащих","Марина","Территория (именительный падеж):",null,null," Логос ИВО                              "," ИВ Учитель ИВО "]
[508,"Краснодар","Краснодара","Р","Синтез Метагалактической Гражданской Конфедерации ИВО","Синтез Метагалактической Гражданской Конфедерации ИВО","Синтез Метагалактической Гражданской Конфедерации ИВО"," ИВ Ипостась ИВО ","Ипостаси ИВО","Византий","Византия","5 Состав: 40 Служащих","Альбина","Территория (родительный падеж):",null,null," Аватар ИВО                            "," ИВ Ипостась ИВО "]
[507,"Красноярск","Красноярска","Р","Синтез Изначально Психодинамического Мастерства ИВО","Синтез Изначально Психодинамического Мастерства ИВО","Синтез Изначально Психодинамического Мастерства ИВО"," ИВ Ипостась ИВ Служащий ИВО ","Ипостаси Служащего ИВО","Янов","Янова","6 Состав: 50 Служащих","Вероника","Владыка",null,null," Ипостась ИВО                        "," ИВ Ипостась ИВ Служащий ИВО "]
[506,"Екатеринбург","Екатеринбурга","Р","Синтез Посвящений ИВО","Синтез Посвящений ИВО","Синтез Посвящений ИВО"," ИВ Ипостась ИВ Посвящённый ИВО ","Ипостаси Посвящённого ИВО","Юлий","Юлия","7 Состав: 59 Служащих","Сиана","Владычица",null,null," Служащий ИВО                      "," ИВ Ипостась ИВ Посвящённый ИВО "]
[505,"Московия","Московии","Р","Синтез Жизни ИВО","Синтез Жизни ИВО","Синтез Жизни ИВО"," ИВ Ипостась ИВ Майтрейя ИВО ","Ипостаси Майтрейя ИВО","Юсеф ","Юсефа","8 Состав: 68 Служащих","Она",null,null,null," Посвящённый ИВО                "," ИВ Ипостась ИВ Майтрейя ИВО "]
[504,"Иркутск","Иркутска","Р","Синтез Воскрешения ИВО","Синтез Воскрешения ИВО","Синтез Воскрешения ИВО"," ИВ Ипостась ИВ Христос ИВО ","Ипостаси Христа ИВО","Владомир  ","Владомира","9 Состав: 76 Служащих","Стефания",null,null,null," Полномочный ИВО                "," ИВ Ипостась ИВ Христос ИВО "]
[503,"Сочи","Сочи","Р","Синтез Пробуждения ИВО","Синтез Пробуждения ИВО","Синтез Пробуждения ИВО"," ИВ Ипостась ИВ Будда ИВО ","Ипостаси Будды ИВО","Савва         ","Саввы","10 Состав: 84 Служащих","Свята",null,null,null," Ману ИВО                               "," ИВ Ипостась ИВ Будда ИВО "]
[502,"Ставрополь","Ставрополя","Р","Синтез Генезиса ИВО","Синтез Генезиса ИВО","Синтез Генезиса ИВО"," ИВ Ипостась ИВ Теург ИВО ","Ипостаси Теурга ИВО","Савелий     ","Савелия","11 Состав: 92 Служащих","Баяна",null,null,null," Теург ИВО                                "," ИВ Ипостась ИВ Теург ИВО "]
[501,"Самара","Самары","Р","Синтез Человечности ИВО","Синтез Человечности ИВО","Синтез Человечности ИВО"," ИВ Ипостась ИВ Творец ИВО ","Ипостаси Творца ИВО","Вильгельм ","Вильгельма","12 Состав: 100 Служащих","Екатерина",null,null,null," Творец ИВО                                "," ИВ Ипостась ИВ Творец ИВО "]
[500,"Ростов-на-Дону","Ростова-на-Дону","Р","Синтез Служения ИВО","Синтез Служения ИВО","Синтез Служения ИВО"," ИВ Ипостась ИВ Аспект ИВО ","Ипостаси Аспекта ИВО","Юстас        ","Юстаса","13 Состав: 108 Служащих","Сивилла",null,null,null," Аспект ИВО                             "," ИВ Ипостась ИВ Аспект ИВО "]
[499,"Челны","Челнов","Р","Синтез Взрастания ИВО","Синтез Взрастания ИВО","Синтез Взрастания ИВО"," ИВ Ипостась ИВ Логос ИВО ","Ипостаси Логоса ИВО","Александр ","Александра","14 Состав: 116 Служащих","Тамила",null,null,null," Майтрейя ИВО                        "," ИВ Ипостась ИВ Логос ИВО "]
[498,"Кавминводы","Кавминвод","Р","Синтез Практики ИВО","Синтез Практики ИВО","Синтез Практики ИВО"," ИВ Ипостась ИВ Ману ИВО ","Ипостаси Ману ИВО","Яромир       ","Яромира","15 Состав: 124 Служащих","Ника",{"$f":"\"Аватар Синтез Синтеза ИВО, Глава ИВДИВО \"&Изначальность&\" Изначальности, Управления Синтеза Кут Хуми\"","v":"Аватар Синтез Синтеза ИВО, Глава ИВДИВО 512 Изначальности, Управления Синтеза Кут Хуми"},null,null," Христос ИВО                           "," ИВ Ипостась ИВ Ману ИВО "]
[497,"Казань","Казани","Р","Синтез Могущества ИВО","Синтез Могущества ИВО","Синтез Могущества ИВО"," ИВ Ипостась ИВ Человек ИВО ","Ипостаси Человека ИВО","Серапис      ","Сераписа","16 Состав: 128 Служащих","Велетте",{"$f":"\"Владыка Синтез Синтеза Изначально Вышестоящего \"&IFERROR(INDEX(_256_ИВО,513-Изначальность),\"ошибка\")&\", Глава Высшей Школы Синтеза \"&Изначальность&\" Изначальности, Управления Синтеза Иосифа\"","v":"Владыка Синтез Синтеза Изначально Вышестоящего Отца ИВО, Глава Высшей Школы Синтеза 512 Изначальности, Управления Синтеза Иосифа"},null,null," Будда ИВО                               "," ИВ Ипостась ИВ Человек ИВО "]
[496,"Севастополь","Севастополя","Р","Синтез Ипостасности ИВО","Синтез Ипостасности ИВО","Синтез Ипостасности ИВО"," ИВ Ипостась ИВ ИВЧеловек ИВО ","Ипостаси ИВ Человека ИВО","Эдуард        ","Эдуарда",null,"Эмилия",{"$f":"\"Владыка Синтез Синтеза Изначального Владыки Кут Хуми, Глава Изначально Метагалактической Академии Наук \"&Территории&\", Управления Синтеза Мории\"","v":"Владыка Синтез Синтеза Изначального Владыки Кут Хуми, Глава Изначально Метагалактической Академии Наук Москвы, Управления Синтеза Мории"},null,null," Изначально Вышестоящий Человек ИВО        "," ИВ Ипостась ИВ ИВЧеловек ИВО "]
[495,"Балтия","Балтии","Р","Синтез Пассионарности ИВО","Синтез Пассионарности ИВО","Синтез Пассионарности ИВО"," ИВ Ипостась ИВ Человек Изначальности ИВО ","Ипостаси Человека Изначальности ИВО","Фадей          ","Фадея",null,"Елена",{"$f":"\"Владыка Синтез Синтеза Изначального Владыки \"&Владыка&\", Глава Изначального Центра Ипостаси Синтеза, Управления Синтеза Филиппа\"","v":"Владыка Синтез Синтеза Изначального Владыки Кут Хуми, Глава Изначального Центра Ипостаси Синтеза, Управления Синтеза Филиппа"},null,null," Человек ИВО                                                                "," ИВ Ипостась ИВ Человек Изначальности ИВО "]
[494,"Бородино","Бородино","М","Синтез Истинности ИВО","Синтез Истинности ИВО","Синтез Истинности ИВО"," ИВ Ипостась ИВ Сын ИВО ","Ипостаси Сына ИВО","Серафим     ","Серафима",null,"Валерия",{"$f":"\"Владыка Синтез Синтеза ИВО, Глава Метагалактической Гражданской Конфедерации \"&Территории&\", Управления Синтеза Византия\"","v":"Владыка Синтез Синтеза ИВО, Глава Метагалактической Гражданской Конфедерации Москвы, Управления Синтеза Византия"},null,null," Сын ИВО                                   "," ИВ Ипостась ИВ Сын ИВО "]
{"$rows_left_out":254}