{"text_format":"1","workbook":"xlsx","n_sheets":5,"sheets":["Рекомендации","Ипостасные","Здание","Этажи","справочники"],"not_rendered":{"charts":0,"images":3,"macros":1,"external_links":0,"defined_names":30,"comments":0,"pivot_tables":0},"unopened":[],"bounds":{"document_bytes":16777216,"sheet_cells":100000,"rows_first":2000,"rows_last":500,"rows_between":2000,"halvings":0,"cell_chars":16384,"cell_head_chars":4096},"cells_cut":0,"cells_raw":0,"read":"whole","date_system":"1900"}

{"sheet":"Рекомендации","index":0,"n_rows":50,"n_cols":1,"rows_kept":50,"cut":false,"hidden":false,"merged":[]}
["Методические рекомендации Главам МАИ и Главам подразделений ИВДИВО для применения Книги подразделения ИВДИВО"]
[]
["Утверждаю. КХ 08122016"]
["Редакция Книги 08 декабря 2016 г."]
[]
["Данная Книга является инструментом подразделения ИВДИВО и обязательна для применения."]
[]
["Книга содержит программы, при ее открытии Excel может запросить разрешения. Разрешайте, чтобы включить весь функционал этого инструмента вашего Служения. Если что-то не работает, значит вы не включили в Excel содержание Книги при ее открытии или у вас настолько старый Excel, что он не понимает применённый язык программирования."]
[]
["Применение Книги начинается с указания ее базовых параметров на листе \"Ипостасные\":"]
["1. В ячейку D2 введите номер Изначальности вашего подразделения."]
["2. Выберите вид состава вашего подразделения."]
["Настройка Книги на этом завершена. Можно вводить данные всех Советов и Составов подразделения и филиалов."]
["Идея в том, что именно в этой Книге должны содержаться данные столпа и контакты Ипостасных вашего подразделения. В контактах обязательно указывайте адрес электронной почты и номер телефона в международном формате."]
["Последовательность действий:"]
["1. На листе \"Ипостасные\" выбираем один из 16 составов и вводим Основной состав подразделения."]
["2. Вводим филиалы с Домами Отца. Логосов и Аватаров филиала с ДО необходимо ввести до ввода Синтезного состава, т.к. в столпе места этих Ипостасных филиалов чётко регламентированы и не могут быть заняты Синтезным составом. Для ввода филиалов с Домами Отца используйте кнопку «Добавить Дом Отца филиала». После каждого нажатия кнопки вводите ФИО Ипостасных филиала."]
["3. Вручную вводим Синтезный состав подразделения, последовательно заполняя вакансии Синтезного состава сверху вниз. Распределение Синтезного состава по Организациям и Домам Отца не регламентировано. Аватары сами набирают Синтезный состав в свои команды и руководят им."]
["4. Вводим Синтезный состав Домов Отца филиалов, последовательно заполняя вакансии Синтезного состава сверху вниз. Данная операция не автоматизирована, но проста в ручном исполнении: в окончании звания Ипостасного дописывайте: [филиал <название территории>]"]
["5. Вводим филиалы до трёх Ипостасных, последовательно заполняя вакансии Синтезного состава сверху вниз. Используйте кнопку «Добавить филиал до 3 Ипостасных». После каждого нажатия кнопки вводите ФИО Ипостасных филиала."]
{"$rows_left_out":31}
{"sheet":"Ипостасные","index":1,"n_rows":274,"n_cols":18,"rows_kept":274,"cut":false,"hidden":false,"merged":[[8,0,8,2],[1,0,1,2]]}
[16,null,null,"Данные вводятся только в ячейки серого цвета!"]
[{"$f":"\"Книга подразделения ИВДИВО «\"&IFERROR(INDEX(справочники!L2:L17,A1),\"такого подразделения нет\")&\"».\"","v":"Книга подразделения ИВДИВО «16 Состав: 128 Служащих»."},null,null,256]
[null,null,"Наименование подразделения в родительном падеже:",{"$f":"IFERROR(INDEX(Название_подразделения_рп,MATCH(Изначальность,Номер_Изначальности,0)),\"такого подразделения нет\")","v":"ИВДИВО"},{"$f":"IF(OR(Изначальность>256,Изначальность<129),\"такого подразделения нет\",\" Изначальности\")","v":" Изначальности"},{"$f":"IFERROR(INDEX(Название_Подразделения,MATCH(Изначальность,Номер_Изначальности,0)),\"такого подразделения нет\")","v":"ИВДИВО"}]
[null,null,"Управление Синтеза",{"$f":"IFERROR(INDEX(_256рица_Синтеза_ИВО,MATCH(Изначальность,Номер_Изначальности,0)),\"такого подразделения нет\")","v":"ИВДИВО"},{"$f":"IFERROR(INDEX(Отделения,MATCH(Изначальность,Номер_Изначальности,0)),\" нет\")","v":"Р"}]
[null,null,"Территория (именительный падеж):",{"$f":"IFERROR(IF(D9=1,INDEX(Территория_,MATCH(Изначальность,Номер_Изначальности,0)),INDEX(Территория_,MATCH(Изначальность,Номер_Изначальности,0))),\" нет\")","v":"Москва"},{"$f":"IF(E4=\"Р\",\"Региональный\",\"Местный\")","v":"Региональный"}]
[null,null,"Территория (родительный падеж):",{"$f":"IFERROR(IF(D9=1,INDEX(Территории_,MATCH(D2,Номер_Изначальности,0)),INDEX(Территории_,MATCH(D2,Номер_Изначальности,0))),\" нет\")","v":"Москвы"},{"$f":"IF(E4=\"Р\",\"Регионального\",\"Местного\")","v":"Регионального"}]
[null,null,"Владыка",{"$f":"IFERROR(INDEX(ИВладыки_родит_падеж,257-Изначальность),\"такого Владыки нет\")","v":"Кут Хуми"}]
[null,null,"Владычица",{"$f":"IFERROR(INDEX(ИВладыки_родит_падеж,385-Изначальность),\"такого Владыки нет\")","v":"Фаинь"}]
[{"$f":"\"Мыслеобраз, Цель, Задача, Устремление \"&Наименование_Подразделения&\" \"&Изначальность&\" Изначальности, \"&Территория&\":\"","v":"Мыслеобраз, Цель, Задача, Устремление ИВДИВО 256 Изначальности, Москва:"},null,null,255]
["Отцовскость ИВО Синтезностью Созидающей Мощью Основ ИВДИВО ИВО",null,null,{"$f":"\"Мыслеобраз \"&Наименование_Подразделения&\" \"&Изначальность&\" Изначальности\"","v":"Мыслеобраз ИВДИВО 256 Изначальности"}]
["Синтезность концентрацией примененного Синтеза Иерархии 256И состоятельностью полномочий служащих синтезипостасно",null,null,{"$f":"\"Цель \"&Наименование_Подразделения&\" \"&Изначальность&\" Изначальности\"","v":"Цель ИВДИВО 256 Изначальности"}]
["Идивные технологии явления физичности Основ ИВО Синтезом ИС ИВДИВО",null,null,{"$f":"\"Задача \"&Наименование_Подразделения&\" \"&Изначальность&\" Изначальности\"","v":"Задача ИВДИВО 256 Изначальности"}]
["Наработать 64ую процессуальность 256 Части ИВО",null,null,{"$f":"\"Устремление \"&Наименование_Подразделения&\" \"&Изначальность&\" Изначальности\"","v":"Устремление ИВДИВО 256 Изначальности"}]
[]
["Совет Изначально Вышестоящего Отца:",null,null,"ФИО","E-mail","Тел.1","Тел.2","WhatsApp","Viber","Город","Служащий Синтеза","Поручения","Личные стяжания","Статус","Мыслеобраз","Цель","Задача","Устремление"]
[null,1,{"$f":"\"Отец, Ипостась Синтез Синтеза Изначально Вышестоящего Отца, Глава \"&Наименование_Подразделения&\" \"&Изначальность&\" Изначальности, Управления Синтеза Кут Хуми\"","v":"Отец, Ипостась Синтез Синтеза Изначально Вышестоящего Отца, Глава ИВДИВО 256 Изначальности, Управления Синтеза Кут Хуми"}]
[null,2,{"$f":"\"Владыка, Ипостась \"&IFERROR(INDEX(_256_ИВО,257-Изначальность),\"ошибка\")&\", Глава Высшей Школы Синтеза ИВДИВО \"&Изначальность&\" Изначальности, Управления Синтеза Иосифа\"","v":"Владыка, Ипостась ИВ Отца ИВО, Глава Высшей Школы Синтеза ИВДИВО 256 Изначальности, Управления Синтеза Иосифа"}]
[null,3,{"$f":"\"Учитель, Ипостась Синтеза Изначального Владыки Кут Хуми, Глава Изначально Метагалактической Академии Наук \"&Территории&\", Управления Синтеза Мории\"","v":"Учитель, Ипостась Синтеза Изначального Владыки Кут Хуми, Глава Изначально Метагалактической Академии Наук Москвы, Управления Синтеза Мории"}]
[null,4,{"$f":"\"Учитель, Ипостась Синтеза Изначального Владыки \"&Владыка&\", Глава Изначального Центра Ипостаси Синтеза \"&Наименование_Подразделения&\", Управления Синтеза Филиппа\"","v":"Учитель, Ипостась Синтеза Изначального Владыки Кут Хуми, Глава Изначального Центра Ипостаси Синтеза ИВДИВО, Управления Синтеза Филиппа"}]
[null,5,{"$f":"\"Учитель, Ипостась Синтеза Изначально Вышестоящего Отца, Глава Метагалактической Гражданской Конфедерации \"&Территории&\", Управления Синтеза Византия\"","v":"Учитель, Ипостась Синтеза Изначально Вышестоящего Отца, Глава Метагалактической Гражданской Конфедерации Москвы, Управления Синтеза Византия"}]
{"$rows_left_out":255}
{"sheet":"Здание","index":2,"n_rows":261,"n_cols":4,"rows_kept":261,"cut":false,"hidden":false,"merged":[[4,2,4,3],[0,2,0,3]]}
[null,null,{"$f":"\"Здание \"&Наименование_Подразделения&\" \"&Изначальность&\" Изначальности, \"&Территория &\"\nна 1 вышестоящем Присутствии \" &Изначальность & \" Изначальности\"","v":"Здание ИВДИВО 256 Изначальности, Москва\nна 1 вышестоящем Присутствии 256 Изначальности"}]
[]
[null,null,"Залы Иерархов ИВДИВО","Залы и кабинеты Ипостасных в Здании"]
[]
[null,null,"Зал Изначально Вышестоящего Отца"]
[256,null,{"$f":"\"Зал и кабинет \"&Ипостасные!C16&\" ИВО\nЗал и кабинет Изначального Владыки ИВО \"&справочники!K2","v":"Зал и кабинет Отец, Ипостась Синтез Синтеза Изначально Вышестоящего Отца, Глава ИВДИВО 256 Изначальности, Управления Синтеза Кут Хуми ИВО\nЗал и кабинет Изначального Владыки ИВО Кут Хуми"},{"$f":"IF(Ипостасные!D16=\"\",\"\", \"Зал и кабинет \"&Ипостасные!C16&\" \"&Ипостасные!D16)&\"\nЗал Совета ИВО\nЗал Совета ИВДИВО\"","v":"\nЗал Совета ИВО\nЗал Совета ИВДИВО"}]
[255,null,{"$f":"\"Зал и кабинет \"&Ипостасные!C17&\" ИВО\nЗал и кабинет Изначального Владыки ИВО \"&справочники!K3","v":"Зал и кабинет Владыка, Ипостась ИВ Отца ИВО, Глава Высшей Школы Синтеза ИВДИВО 256 Изначальности, Управления Синтеза Иосифа ИВО\nЗал и кабинет Изначального Владыки ИВО Иосифа"},{"$f":"IF(Ипостасные!D17=\"\",\"\", \"Зал и кабинет \"&Ипостасные!C17&\" \"&Ипостасные!D17)","v":""}]
[254,null,{"$f":"\"Зал и кабинет \"&Ипостасные!C18&\" ИВО\nЗал и кабинет Изначального Владыки ИВО \"&справочники!K4","v":"Зал и кабинет Учитель, Ипостась Синтеза Изначального Владыки Кут Хуми, Глава Изначально Метагалактической Академии Наук Москвы, Управления Синтеза Мории ИВО\nЗал и кабинет Изначального Владыки ИВО Мории"},{"$f":"IF(Ипостасные!D18=\"\",\"\", \"Зал и кабинет \"&Ипостасные!C18&\" \"&Ипостасные!D18)","v":""}]
[253,null,{"$f":"\"Зал и кабинет \"&Ипостасные!C19&\" ИВО\nЗал и кабинет Изначального Владыки ИВО \"&справочники!K5","v":"Зал и кабинет Учитель, Ипостась Синтеза Изначального Владыки Кут Хуми, Глава Изначального Центра Ипостаси Синтеза ИВДИВО, Управления Синтеза Филиппа ИВО\nЗал и кабинет Изначального Владыки ИВО Филиппа"},{"$f":"IF(Ипостасные!D19=\"\",\"\", \"Зал и кабинет \"&Ипостасные!C19&\" \"&Ипостасные!D19)","v":""}]
[252,null,{"$f":"\"Зал и кабинет \"&Ипостасные!C20&\" ИВО\nЗал и кабинет Изначального Владыки ИВО \"&справочники!K6","v":"Зал и кабинет Учитель, Ипостась Синтеза Изначально Вышестоящего Отца, Глава Метагалактической Гражданской Конфедерации Москвы, Управления Синтеза Византия ИВО\nЗал и кабинет Изначального Владыки ИВО Византия"},{"$f":"IF(Ипостасные!D20=\"\",\"\", \"Зал и кабинет \"&Ипостасные!C20&\" \"&Ипостасные!D20)","v":""}]
[251,null,{"$f":"\"Зал и кабинет \"&Ипостасные!C21&\" ИВО\nЗал и кабинет Изначального Владыки ИВО \"&справочники!K7","v":"Зал и кабинет Учитель, Ипостась Синтеза Изначально Вышестоящего Отца, Глава Дома Изначально Вышестоящего Отца Психодинамики 256 Изначальности, Управления Синтеза Янова ИВО\nЗал и кабинет Изначального Владыки ИВО Янова"},{"$f":"IF(Ипостасные!D21=\"\",\"\", \"Зал и кабинет \"&Ипостасные!C21&\" \"&Ипостасные!D21)","v":""}]
[250,null,{"$f":"\"Зал и кабинет \"&Ипостасные!C22&\" ИВО\nЗал и кабинет Изначального Владыки ИВО \"&справочники!K8","v":"Зал и кабинет Учитель, Ипостась Синтеза Изначально Вышестоящего Отца, Глава Дома Изначально Вышестоящего Отца Статусов 256 Изначальности, Управления Синтеза Юлия ИВО\nЗал и кабинет Изначального Владыки ИВО Юлия"},{"$f":"IF(Ипостасные!D22=\"\",\"\", \"Зал и кабинет \"&Ипостасные!C22&\" \"&Ипостасные!D22)","v":""}]
[249,null,{"$f":"\"Зал и кабинет \"&Ипостасные!C23&\" ИВО\nЗал и кабинет Изначального Владыки ИВО \"&справочники!K9","v":"Зал и кабинет Учитель, Ипостась Синтеза Изначально Вышестоящего Отца, Глава Дома Изначально Вышестоящего Отца Посвящений 256 Изначальности, Управления Синтеза Юсефа ИВО\nЗал и кабинет Изначального Владыки ИВО Юсефа"},{"$f":"IF(Ипостасные!D23=\"\",\"\", \"Зал и кабинет \"&Ипостасные!C23&\" \"&Ипостасные!D23)","v":""}]
[248,null,{"$f":"\"Зал и кабинет \"&Ипостасные!C24&\" ИВО\nЗал и кабинет Изначального Владыки ИВО \"&справочники!K10","v":"Зал и кабинет Учитель, Ипостась Синтеза Изначально Вышестоящего Отца, Глава Метагалактического Агентства Информации Москвы, Управления Синтеза Владомира ИВО\nЗал и кабинет Изначального Владыки ИВО Владомира"},{"$f":"IF(Ипостасные!D24=\"\",\"\", \"Зал и кабинет \"&Ипостасные!C24&\" \"&Ипостасные!D24)","v":""}]
[247,null,{"$f":"\"Зал и кабинет \"&Ипостасные!C26&\" ИВО\nЗал и кабинет Изначального Владыки ИВО \"&справочники!K11","v":"Зал и кабинет Логос, Ипостась Синтеза Изначально Вышестоящего Отца, Глава Дома Отца Генезиса ИВО, Управления Синтеза Саввы ИВО\nЗал и кабинет Изначального Владыки ИВО Саввы"},{"$f":"IF(Ипостасные!D26=\"\",\"\", \"Зал и кабинет \"&Ипостасные!C26&\" \"&Ипостасные!D26)","v":""}]
[246,null,{"$f":"\"Зал и кабинет \"&Ипостасные!C27&\" ИВО\nЗал и кабинет Изначального Владыки ИВО \"&справочники!K12","v":"Зал и кабинет Логос, Ипостась Синтеза Изначально Вышестоящего Отца, Глава Дома Отца Практик ИВО, Управления Синтеза Савелия ИВО\nЗал и кабинет Изначального Владыки ИВО Савелия"},{"$f":"IF(Ипостасные!D27=\"\",\"\", \"Зал и кабинет \"&Ипостасные!C27&\" \"&Ипостасные!D27)","v":""}]
[245,null,{"$f":"\"Зал и кабинет \"&Ипостасные!C28&\" ИВО\nЗал и кабинет Изначального Владыки ИВО \"&справочники!K13","v":"Зал и кабинет Логос, Ипостась Синтеза Изначально Вышестоящего Отца, Глава Дома Отца Человечности ИВО, Управления Синтеза Вильгельма ИВО\nЗал и кабинет Изначального Владыки ИВО Вильгельма"},{"$f":"IF(Ипостасные!D28=\"\",\"\", \"Зал и кабинет \"&Ипостасные!C28&\" \"&Ипостасные!D28)","v":""}]
[244,null,{"$f":"\"Зал и кабинет \"&Ипостасные!C29&\" ИВО\nЗал и кабинет Изначального Владыки ИВО \"&справочники!K14","v":"Зал и кабинет Логос, Ипостась Синтеза Изначально Вышестоящего Отца, Глава Дома Отца Служения ИВО, Управления Синтеза Юстаса ИВО\nЗал и кабинет Изначального Владыки ИВО Юстаса"},{"$f":"IF(Ипостасные!D29=\"\",\"\", \"Зал и кабинет \"&Ипостасные!C29&\" \"&Ипостасные!D29)","v":""}]
[243,null,{"$f":"\"Зал и кабинет \"&Ипостасные!C30&\" ИВО\nЗал и кабинет Изначального Владыки ИВО \"&справочники!K15","v":"Зал и кабинет Логос, Ипостась Синтеза Изначально Вышестоящего Отца, Глава Дома Отца Взрастания ИВО, Управления Синтеза Александра ИВО\nЗал и кабинет Изначального Владыки ИВО Александра"},{"$f":"IF(Ипостасные!D30=\"\",\"\", \"Зал и кабинет \"&Ипостасные!C30&\" \"&Ипостасные!D30)","v":""}]
[242,null,{"$f":"\"Зал и кабинет \"&Ипостасные!C31&\" ИВО\nЗал и кабинет Изначального Владыки ИВО \"&справочники!K16","v":"Зал и кабинет Логос, Ипостась Синтеза Изначально Вышестоящего Отца, Глава Дома Отца Воскрешения ИВО, Управления Синтеза Яромира ИВО\nЗал и кабинет Изначального Владыки ИВО Яромира"},{"$f":"IF(Ипостасные!D31=\"\",\"\", \"Зал и кабинет \"&Ипостасные!C31&\" \"&Ипостасные!D31)","v":""}]
{"$rows_left_out":242}
{"sheet":"Этажи","index":3,"n_rows":4,"n_cols":1,"rows_kept":4,"cut":false,"hidden":false,"merged":[[0,0,0,1],[1,0,1,1],[18,0,18,1],[3,0,3,1]]}
[{"$f":"\"План здания \"&Наименование_Подразделения&\" \"&Изначальность&\" Изначальности, \"&Территория","v":"План здания ИВДИВО 256 Изначальности, Москва"}]
["В плане здания распределены только Ипостасные ИВДИВО Основного и Синтезного состава. Служащие, Посвящённые и Полномочные приписаны к Ипостасным и составляют их группы явления в Залах."]
[]
["План 256-ти этажей:"]

{"sheet":"справочники","index":4,"n_rows":274,"n_cols":17,"rows_kept":274,"cut":false,"hidden":false,"merged":[]}
["№ Изн","территория","территории","Отделения","Название подразделения","Название подразделения в родительном падеже","128рица Синтеза ИВО","256-рица ИВО","256-рица ИВО в родительном падеже","ИВладыки","ИВладыки","Вид подразделения",{"$f":"\"Контакты Ипостасных подразделения \"&Наименование_Подразделения&\" \"&Изначальность&\" Изначальности\"&\", \"&Территория","v":"Контакты Ипостасных подразделения ИВДИВО 256 Изначальности, Москва"},null,null,null,"128 частей"]
[256,"Москва","Москвы","Р","ИВДИВО","ИВДИВО","ИВДИВО","ИВ Отец ИВО","ИВ Отца ИВО","Кут Хуми   ","Кут Хуми","1 Состав: 16 Служащих","Фаинь",null,0,0," Отец ИВО                               "]
[255,"Санкт-Петербург","Санкт-Петербурга","Р","Изначально Вышестоящая Иерархия ИВО ИВДИВО","Изначально Вышестоящей Иерархии ИВО ИВДИВО","Иерархия ИВО","ИВ Владыка ИВО","ИВ Владыки ИВО","Иосиф","Иосифа","2 Состав: 22 Служащих","Славия","Наименование подразделения в родительном падеже:",null,null," Владыка ИВО                         "]
[254,"Новосибирск","Новосибирска","Р","Синтез Изначально Вышестоящего Человека ИВО ИВДИВО","Синтеза Изначально Вышестоящего Человека ИВО ИВДИВО","Цивилизация ИВО","ИВ Учитель ИВО","ИВ Учителя ИВО","Мория","Мории","3 Состав: 27 Служащих","Свет","Управление Синтеза",null,null," Учитель ИВО                          "]
[253,"Крым","Крыма","Р","Синтез Изначально Метагалактической Цивилизации ИВО ИВДИВО","Синтеза Изначально Метагалактической Цивилизации ИВО ИВДИВО","Психодинамика ИВО","ИВ Логос ИВО","ИВ Логоса ИВО","Филипп","Филиппа","4 Состав: 33 Служащих","Марина","Территория (именительный падеж):",null,null," Логос ИВО                              "]
[252,"Краснодар","Краснодара","Р","Синтез Метагалактической Гражданской Конфедерации ИВО ИВДИВО","Синтеза Метагалактической Гражданской Конфедерации ИВО ИВДИВО","Человек ИВО","ИВ Аватар ИВО","ИВ Аватара ИВО","Византий","Византия","5 Состав: 40 Служащих","Альбина","Территория (родительный падеж):",null,null," Аватар ИВО                            "]
[251,"Красноярск","Красноярска","Р","Синтез Изначально Психодинамического Мастерства ИВО ИВДИВО","Синтеза Изначально Психодинамического Мастерства ИВО ИВДИВО","Конфедерация ИВО","ИВ Ипостась ИВО","ИВ Ипостаси ИВО","Янов","Янова","6 Состав: 50 Служащих","Вероника","Владыка",null,null," Ипостась ИВО                        "]
[250,"Екатеринбург","Екатеринбурга","Р","Синтез Изначально Вышестоящих Статусов ИВО ИВДИВО","Синтеза Изначально Вышестоящих Статусов ИВО ИВДИВО","Теофа ИВО","ИВ Служащий ИВО","ИВ Служащего ИВО","Юлий","Юлия","7 Состав: 59 Служащих","Сиана","Владычица",null,null," Служащий ИВО                      "]
[249,"Московия","Московии","Р","Синтез Изначально Вышестоящих Посвящений ИВО ИВДИВО","Синтеза Изначально Вышестоящих Посвящений ИВО ИВДИВО","Изначальная Метагалактика ИВО","ИВ Посвящённый ИВО","ИВ Посвящённого ИВО","Юсеф ","Юсефа","8 Состав: 68 Служащих","Она",null,null,null," Посвящённый ИВО                "]
[248,"Иркутск","Иркутска","Р","Синтез Изначально Вышестоящего Полномочного ИВО ИВДИВО","Синтеза Изначально Вышестоящего Полномочного ИВО ИВДИВО","ИВДИВО Полномочного","ИВ Полномочный ИВО","ИВ Полномочного ИВО","Владомир  ","Владомира","9 Состав: 76 Служащих","Стефания",null,null,null," Полномочный ИВО                "]
[247,"Сочи","Сочи","Р","Синтез Генезиса ИВО ИВДИВО","Синтеза Генезиса ИВО ИВДИВО","Статусы ИВО","ИВ Ману ИВО","ИВ Ману ИВО","Савва         ","Саввы","10 Состав: 84 Служащих","Свята",null,null,null," Ману ИВО                               "]
[246,"Ставрополь","Ставрополя","Р","Синтез Практик ИВО ИВДИВО","Синтеза Практик ИВО ИВДИВО","Посвящения ИВО","ИВ Теург ИВО","ИВ Теурга ИВО","Савелий     ","Савелия","11 Состав: 92 Служащих","Баяна",null,null,null," Теург ИВО                                "]
[245,"Самара","Самары","Р","Синтез Человечности ИВО ИВДИВО","Синтеза Человечности ИВО ИВДИВО","Технологии ИВО","ИВ Творец ИВО","ИВ Творца ИВО","Вильгельм ","Вильгельма","12 Состав: 100 Служащих","Екатерина",null,null,null," Творец ИВО                                "]
[244,"Ростов-на-Дону","Ростова-на-Дону","Р","Синтез Служения ИВО ИВДИВО","Синтеза Служения ИВО ИВДИВО","Изначальности ИВО","ИВ Аспект ИВО","ИВ Аспекта ИВО","Юстас        ","Юстаса","13 Состав: 108 Служащих","Сивилла",null,null,null," Аспект ИВО                             "]
[243,"Челны","Челнов","Р","Синтез Взрастания ИВО ИВДИВО","Синтеза Взрастания ИВО ИВДИВО","Присутствия ИВО","ИВ Майтрейя ИВО","ИВ Майтрейи ИВО","Александр ","Александра","14 Состав: 116 Служащих","Тамила",null,null,null," Майтрейя ИВО                        "]
[242,"Кавминводы","Кавминвод","Р","Синтез Воскрешения ИВО ИВДИВО","Синтеза Воскрешения ИВО ИВДИВО","Миры ИВО","ИВ Христос ИВО","ИВ Христа ИВО","Яромир       ","Яромира","15 Состав: 124 Служащих","Ника",{"$f":"\"Отец, Ипостась Синтез Синтеза Изначально Вышестоящего Отца, Глава \"&Наименование_Подразделения&\" \"&Изначальность&\" Изначальности, Управления Синтеза Кут Хуми\"","v":"Отец, Ипостась Синтез Синтеза Изначально Вышестоящего Отца, Глава ИВДИВО 256 Изначальности, Управления Синтеза Кут Хуми"},null,null," Христос ИВО                           "]
[241,"Казань","Казани","Р","Синтез Пробуждения ИВО ИВДИВО","Синтеза Пробуждения ИВО ИВДИВО","Метагалактика ИВО","ИВ Будда ИВО","ИВ Будды ИВО","Серапис      ","Сераписа","16 Состав: 128 Служащих","Велетте",{"$f":"\"Владыка, Ипостась \"&IFERROR(INDEX(_256_ИВО,257-Изначальность),\"ошибка\")&\", Глава Высшей Школы Синтеза ИВДИВО \"&Изначальность&\" Изначальности, Управления Синтеза Иосифа\"","v":"Владыка, Ипостась ИВ Отца ИВО, Глава Высшей Школы Синтеза ИВДИВО 256 Изначальности, Управления Синтеза Иосифа"},null,null," Будда ИВО                               "]
[240,"Севастополь","Севастополя","Р","Синтез Ипостасности ИВО ИВДИВО","Синтеза Ипостасности ИВО ИВДИВО","Синтез ИВДИВО Изначального Неизречённого","ИВ ИВЧеловек ИВО","ИВ ИВЧеловека ИВО","Эдуард        ","Эдуарда",null,"Эмилия",{"$f":"\"Учитель, Ипостась Синтеза Изначального Владыки Кут Хуми, Глава Изначально Метагалактической Академии Наук \"&Территории&\", Управления Синтеза Мории\"","v":"Учитель, Ипостась Синтеза Изначального Владыки Кут Хуми, Глава Изначально Метагалактической Академии Наук Москвы, Управления Синтеза Мории"},null,null," Изначально Вышестоящий Человек ИВО        "]
[239,"Балтия","Балтии","Р","Синтез Пассионарности ИВО ИВДИВО","Синтеза Пассионарности ИВО ИВДИВО","Синтез Изначального Предвечного ИВО","ИВ Человек ИВО","ИВ Человека ИВО","Фадей          ","Фадея",null,"Елена",{"$f":"\"Учитель, Ипостась Синтеза Изначального Владыки \"&Владыка&\", Глава Изначального Центра Ипостаси Синтеза \"&Наименование_Подразделения&\", Управления Синтеза Филиппа\"","v":"Учитель, Ипостась Синтеза Изначального Владыки Кут Хуми, Глава Изначального Центра Ипостаси Синтеза ИВДИВО, Управления Синтеза Филиппа"},null,null," Человек ИВО                                                                "]
[238,"Бородино","Бородино","М","Синтез Истинности ИВО ИВДИВО","Синтеза Истинности ИВО ИВДИВО","Синтез Изначального Всемогущего ИВО","ИВ Сын ИВО","ИВ Сына ИВО","Серафим     ","Серафима",null,"Валерия",{"$f":"\"Учитель, Ипостась Синтеза Изначально Вышестоящего Отца, Глава Метагалактической Гражданской Конфедерации \"&Территории&\", Управления Синтеза Византия\"","v":"Учитель, Ипостась Синтеза Изначально Вышестоящего Отца, Глава Метагалактической Гражданской Конфедерации Москвы, Управления Синтеза Византия"},null,null," Сын ИВО                                   "]
{"$rows_left_out":254}