{"text_format":"1","workbook":"xlsx","n_sheets":5,"sheets":["Рекомендации","Полномочные","Здание","Этажи","справочники"],"not_rendered":{"charts":0,"images":4,"macros":1,"external_links":0,"defined_names":28,"comments":0,"pivot_tables":0},"unopened":[],"bounds":{"document_bytes":16777216,"sheet_cells":100000,"rows_first":2000,"rows_last":500,"rows_between":2000,"halvings":0,"cell_chars":16384,"cell_head_chars":4096},"cells_cut":0,"cells_raw":0,"read":"whole","date_system":"1900"}

{"sheet":"Рекомендации","index":0,"n_rows":50,"n_cols":1,"rows_kept":50,"cut":false,"hidden":false,"merged":[]}
["Методические рекомендации Главам МАИ и Главам подразделений ИВДИВО для применения Книги подразделения ИВДИВО"]
["Утверждаю КХ 09.09.2016"]
[]
["Редакция Книги 14 октября 2016 г."]
[]
["Данная Книга является инструментом подразделения ИВДИВО и обязательна для применения."]
[]
["Книга содержит программы, при ее открытии Excel может запросить разрешения. Разрешайте, чтобы включить весь функционал этого инструмента вашего Служения. Если что-то не работает, значит вы не включили в Excel содержание Книги при ее открытии или у вас настолько старый Excel, что он не понимает применённый язык программирования."]
[]
["Применение Книги начинается с указания ее базовых параметров на листе \"Полномочные\":"]
["1. В ячейку D2 введите номер Изначальности вашего подразделения."]
["2. Выберите вид состава вашего подразделения."]
["Настройка Книги на этом завершена. Можно вводить данные всех Советов и Составов подразделения и филиалов."]
["Идея в том, что именно в этой Книге должны содержаться данные столпа и контакты Полномочных вашего подразделения. В контактах обязательно указывайте адрес электронной почты и номер телефона в международном формате."]
["Последовательность действий:"]
["1. На листе \"Полномочные\" выбираем один из 14 составов и вводим Основной состав подразделения."]
["2. Вводим филиалы с Домами Отца. Логосов и Аспектов филиала с ДО необходимо ввести до ввода Синтезного состава, т.к. в столпе места этих Служащих филиалов чётко регламентированы и не могут быть заняты Синтезным составом. Для ввода филиалов с Домами Отца используйте кнопку «Добавить Дом Отца филиала». После каждого нажатия кнопки вводите ФИО Служащих филиала."]
["3. Вручную вводим Синтезный состав подразделения, последовательно заполняя вакансии Синтезного состава сверху вниз. Распределение Синтезного состава по Организациям и Домам Отца не регламентировано. Аспекты сами набирают Синтезный состав в свои команды и руководят им."]
["4. Вводим Синтезный состав Домов Отца филиалов, последовательно заполняя вакансии Синтезного состава сверху вниз. Данная операция не автоматизирована, но проста в ручном исполнении: в окончании звания Служащего дописывайте: [филиал <название территории>]"]
["5. Вводим филиалы до трёх Служащих, последовательно заполняя вакансии Синтезного состава сверху вниз. Используйте кнопку «Добавить филиал до 3 Служащих». После каждого нажатия кнопки вводите ФИО Служащих филиала."]
{"$rows_left_out":31}
{"sheet":"Полномочные","index":1,"n_rows":274,"n_cols":18,"rows_kept":274,"cut":false,"hidden":false,"merged":[[8,0,8,2],[1,0,1,2]]}
[9,null,null,"Данные вводятся только в ячейки серого цвета!"]
[{"$f":"\"Книга подразделения ИВДИВО «\"&IFERROR(INDEX(справочники!N2:N15,A1),\"такого подразделения нет\")&\"».\"","v":"Книга подразделения ИВДИВО «9 Состав: 84 Служащих»."},null,null,255]
[null,null,"Наименование подразделения в родительном падеже:",{"$f":"IFERROR(INDEX(Название_подразделения_рп,MATCH(Изначальность,Номер_Изначальности,0)),\"такого подразделения нет\")","v":"Иерархии ИВО ИВДИВО"},{"$f":"IF(OR(Изначальность>256,Изначальность<129),\"такого подразделения нет\",\" Изначальности\")","v":" Изначальности"}]
[null,null,"Управление Синтеза",{"$f":"IFERROR(INDEX(Ипостась_Синтеза_,MATCH(Изначальность,Номер_Изначальности,0)),\"такого подразделения нет\")","v":"Иерархия ИВО"},{"$f":"IFERROR(INDEX(Отделения,MATCH(Изначальность,Номер_Изначальности,0)),\" нет\")","v":"Р"}]
[null,null,"Территория (именительный падеж):",{"$f":"IFERROR(IF(D9=1,INDEX(Территория_,MATCH(Изначальность,Номер_Изначальности,0)),INDEX(Территория_,MATCH(Изначальность,Номер_Изначальности,0))),\" нет\")","v":"Санкт-Петербург"},{"$f":"IF(E4=\"Р\",\"Региональный\",\"Местный\")","v":"Региональный"}]
[null,null,"Территория (родительный падеж):",{"$f":"IFERROR(IF(D9=1,INDEX(Территории_,MATCH(D2,Номер_Изначальности,0)),INDEX(Территории_,MATCH(D2,Номер_Изначальности,0))),\" нет\")","v":"Санкт-Петербурга"},{"$f":"IF(E4=\"Р\",\"Регионального\",\"Местного\")","v":"Регионального"}]
[null,null,"Владыка",{"$f":"IFERROR(INDEX(ИВладыки_родит_падеж,257-Изначальность),\"такого Владыки нет\")","v":"Иосифа"}]
[null,null,"Владычица",{"$f":"IFERROR(INDEX(ИВладыки_родит_падеж,385-Изначальность),\"такого Владыки нет\")","v":"Славии"}]
[{"$f":"\"Мыслеобраз, Цель, Задача, Устремление \"&Наименование_Подразделения&\" \"&Изначальность&\" Изначальности, \"&Территория&\":\"","v":"Мыслеобраз, Цель, Задача, Устремление Иерархии ИВО ИВДИВО 255 Изначальности, Санкт-Петербург:"},null,null,255]
[null,null,null,{"$f":"\"Мыслеобраз \"&Наименование_Подразделения&\" \"&Изначальность&\" Изначальности\"","v":"Мыслеобраз Иерархии ИВО ИВДИВО 255 Изначальности"}]
[null,null,null,{"$f":"\"Цель \"&Наименование_Подразделения&\" \"&Изначальность&\" Изначальности\"","v":"Цель Иерархии ИВО ИВДИВО 255 Изначальности"}]
[null,null,null,{"$f":"\"Задача \"&Наименование_Подразделения&\" \"&Изначальность&\" Изначальности\"","v":"Задача Иерархии ИВО ИВДИВО 255 Изначальности"}]
[null,null,null,{"$f":"\"Устремление \"&Наименование_Подразделения&\" \"&Изначальность&\" Изначальности\"","v":"Устремление Иерархии ИВО ИВДИВО 255 Изначальности"}]
[]
["Совет Изначально Вышестоящего Отца:",null,null,"ФИО","E-mail","Тел.1","Тел.2","WhatsApp","Viber","Город","Служащий Синтеза","Поручения","Личные стяжания","Статус","Мыслеобраз","Цель","Задача","Устремление"]
[null,1,{"$f":"\"Будда, Ипостась Изначально Вышестоящего Отца, Глава \"&Наименование_Подразделения&\" \"&Изначальность&\" Изначальности, Управления Синтеза \"&IFERROR(INDEX(ИВладыки_родит_падеж,B16),\"ошибка\")","v":"Будда, Ипостась Изначально Вышестоящего Отца, Глава Иерархии ИВО ИВДИВО 255 Изначальности, Управления Синтеза Кут Хуми"}]
[null,2,{"$f":"\"Владыка, Ипостась \"&IFERROR(INDEX(Ипостась_Изначального_,257-Изначальность),\"ошибка\")&\", Глава Высшей Школы Синтеза ИДИВО \"&Изначальность&\" Изначальности, Управления Синтеза \"&IFERROR(INDEX(ИВладыки_родит_падеж,B17),\"ошибка\")","v":"Владыка, Ипостась Изначальной Матери, Глава Высшей Школы Синтеза ИДИВО 255 Изначальности, Управления Синтеза Иосифа"}]
[null,3,{"$f":"\"Владычица, Ипостась Основы \"&IFERROR(INDEX(Ипостась_Основы_,257-Изначальность),\"ошибка\")&\", Глава Метагалактической Академии Наук \"&Территории&\", Управления Синтеза \"&IFERROR(INDEX(ИВладыки_родит_падеж,B18),\"ошибка\")","v":"Владычица, Ипостась Основы Изначальной Матери, Глава Метагалактической Академии Наук Санкт-Петербурга, Управления Синтеза Мории"}]
[null,4,{"$f":"\"Учитель, Ипостась Синтеза Кут Хуми, Глава Дома Статусного Синтеза \"&Территории&\", Управления Синтеза \"&IFERROR(INDEX(ИВладыки_родит_падеж,B19),\"ошибка\")","v":"Учитель, Ипостась Синтеза Кут Хуми, Глава Дома Статусного Синтеза Санкт-Петербурга, Управления Синтеза Филиппа"}]
[null,5,{"$f":"\"Учитель, Ипостась Синтеза Фаинь, Глава Дома Посвящений \"&Территории&\", Управления Синтеза \"&IFERROR(INDEX(ИВладыки_родит_падеж,B20),\"ошибка\")","v":"Учитель, Ипостась Синтеза Фаинь, Глава Дома Посвящений Санкт-Петербурга, Управления Синтеза Византия"}]
{"$rows_left_out":255}
{"sheet":"Здание","index":2,"n_rows":261,"n_cols":4,"rows_kept":261,"cut":false,"hidden":false,"merged":[[4,2,4,3],[0,2,0,3]]}
[null,null,{"$f":"\"Здание \"&Наименование_Подразделения&\" \"&Изначальность&\" Изначальности, \"&Территория &\"\nна 1 вышестоящем Присутствии \" &Изначальность & \" Изначальности\"","v":"Здание Иерархии ИВО ИВДИВО 255 Изначальности, Санкт-Петербург\nна 1 вышестоящем Присутствии 255 Изначальности"}]
[]
[null,null,"Залы Иерархов ИВДИВО","Залы и кабинеты Полномочных в Здании"]
[]
[null,null,"Зал Изначально Вышестоящего Отца"]
[256,null,{"$f":"\"Зал и кабинет \"&справочники!E2&\" ИВО\nЗал и кабинет Изначального Владыки ИВО \"&справочники!M2","v":"Зал и кабинет Изначального Отца ИВО\nЗал и кабинет Изначального Владыки ИВО Кут Хуми"},{"$f":"IF(Полномочные!D16=\"\",\"\", \"Зал и кабинет \"&Полномочные!C16&\" \"&Полномочные!D16)&\"\nЗал Совета ИВО\nЗал Совета ИВДИВО\"","v":"\nЗал Совета ИВО\nЗал Совета ИВДИВО"}]
[255,null,{"$f":"\"Зал и кабинет \"&справочники!E3&\" ИВО\nЗал и кабинет Изначального Владыки ИВО \"&справочники!M3","v":"Зал и кабинет Изначальной Матери ИВО\nЗал и кабинет Изначального Владыки ИВО Иосифа"},{"$f":"IF(Полномочные!D17=\"\",\"\", \"Зал и кабинет \"&Полномочные!C17&\" \"&Полномочные!D17)","v":""}]
[254,null,{"$f":"\"Зал и кабинет \"&справочники!E4&\" ИВО\nЗал и кабинет Изначального Владыки ИВО \"&справочники!M4","v":"Зал и кабинет Изначального Сына ИВО\nЗал и кабинет Изначального Владыки ИВО Мории"},{"$f":"IF(Полномочные!D18=\"\",\"\", \"Зал и кабинет \"&Полномочные!C18&\" \"&Полномочные!D18)","v":""}]
[253,null,{"$f":"\"Зал и кабинет \"&справочники!E5&\" ИВО\nЗал и кабинет Изначального Владыки ИВО \"&справочники!M5","v":"Зал и кабинет Изначальной Дочери ИВО\nЗал и кабинет Изначального Владыки ИВО Филиппа"},{"$f":"IF(Полномочные!D19=\"\",\"\", \"Зал и кабинет \"&Полномочные!C19&\" \"&Полномочные!D19)","v":""}]
[252,null,{"$f":"\"Зал и кабинет \"&справочники!E6&\" ИВО\nЗал и кабинет Изначального Владыки ИВО \"&справочники!M6","v":"Зал и кабинет Изначального Аватара ИВО\nЗал и кабинет Изначального Владыки ИВО Византия"},{"$f":"IF(Полномочные!D20=\"\",\"\", \"Зал и кабинет \"&Полномочные!C20&\" \"&Полномочные!D20)","v":""}]
[251,null,{"$f":"\"Зал и кабинет \"&справочники!E7&\" ИВО\nЗал и кабинет Изначального Владыки ИВО \"&справочники!M7","v":"Зал и кабинет Изначального Майтрейи ИВО\nЗал и кабинет Изначального Владыки ИВО Янова"},{"$f":"IF(Полномочные!D21=\"\",\"\", \"Зал и кабинет \"&Полномочные!C21&\" \"&Полномочные!D21)","v":""}]
[250,null,{"$f":"\"Зал и кабинет \"&справочники!E8&\" ИВО\nЗал и кабинет Изначального Владыки ИВО \"&справочники!M8","v":"Зал и кабинет Изначального Христа ИВО\nЗал и кабинет Изначального Владыки ИВО Юлия"},{"$f":"IF(Полномочные!D22=\"\",\"\", \"Зал и кабинет \"&Полномочные!C22&\" \"&Полномочные!D22)","v":""}]
[249,null,{"$f":"\"Зал и кабинет \"&справочники!E9&\" ИВО\nЗал и кабинет Изначального Владыки ИВО \"&справочники!M9","v":"Зал и кабинет Изначального Будды ИВО\nЗал и кабинет Изначального Владыки ИВО Юсефа"},{"$f":"IF(Полномочные!D23=\"\",\"\", \"Зал и кабинет \"&Полномочные!C23&\" \"&Полномочные!D23)","v":""}]
[248,null,{"$f":"\"Зал и кабинет \"&справочники!E10&\" ИВО\nЗал и кабинет Изначального Владыки ИВО \"&справочники!M10","v":"Зал и кабинет Изначального Владыки ИВО\nЗал и кабинет Изначального Владыки ИВО Владомира"},{"$f":"IF(Полномочные!D25=\"\",\"\", \"Зал и кабинет \"&Полномочные!C25&\" \"&Полномочные!D25)","v":""}]
[247,null,{"$f":"\"Зал и кабинет \"&справочники!E11&\" ИВО\nЗал и кабинет Изначального Владыки ИВО \"&справочники!M11","v":"Зал и кабинет Изначального Учителя ИВО\nЗал и кабинет Изначального Владыки ИВО Саввы"},{"$f":"IF(Полномочные!D26=\"\",\"\", \"Зал и кабинет \"&Полномочные!C26&\" \"&Полномочные!D26)","v":""}]
[246,null,{"$f":"\"Зал и кабинет \"&справочники!E12&\" ИВО\nЗал и кабинет Изначального Владыки ИВО \"&справочники!M12","v":"Зал и кабинет Изначального Логоса ИВО\nЗал и кабинет Изначального Владыки ИВО Савелия"},{"$f":"IF(Полномочные!D27=\"\",\"\", \"Зал и кабинет \"&Полномочные!C27&\" \"&Полномочные!D27)","v":""}]
[245,null,{"$f":"\"Зал и кабинет \"&справочники!E13&\" ИВО\nЗал и кабинет Изначального Владыки ИВО \"&справочники!M13","v":"Зал и кабинет Изначального Аспекта ИВО\nЗал и кабинет Изначального Владыки ИВО Вильгельма"},{"$f":"IF(Полномочные!D28=\"\",\"\", \"Зал и кабинет \"&Полномочные!C28&\" \"&Полномочные!D28)","v":""}]
[244,null,{"$f":"\"Зал и кабинет \"&справочники!E14&\" ИВО\nЗал и кабинет Изначального Владыки ИВО \"&справочники!M14","v":"Зал и кабинет Изначальной Ипостаси ИВО\nЗал и кабинет Изначального Владыки ИВО Юстаса"},{"$f":"IF(Полномочные!D29=\"\",\"\", \"Зал и кабинет \"&Полномочные!C29&\" \"&Полномочные!D29)","v":""}]
[243,null,{"$f":"\"Зал и кабинет \"&справочники!E15&\" ИВО\nЗал и кабинет Изначального Владыки ИВО \"&справочники!M15","v":"Зал и кабинет Изначального Служащего ИВО\nЗал и кабинет Изначального Владыки ИВО Александра"},{"$f":"IF(Полномочные!D30=\"\",\"\", \"Зал и кабинет \"&Полномочные!C30&\" \"&Полномочные!D30)","v":""}]
[242,null,{"$f":"\"Зал и кабинет \"&справочники!E16&\" ИВО\nЗал и кабинет Изначального Владыки ИВО \"&справочники!M16","v":"Зал и кабинет Изначального Посвящённого ИВО\nЗал и кабинет Изначального Владыки ИВО Яромира"},{"$f":"IF(Полномочные!D31=\"\",\"\", \"Зал и кабинет \"&Полномочные!C31&\" \"&Полномочные!D31)","v":""}]
{"$rows_left_out":242}
{"sheet":"Этажи","index":3,"n_rows":4,"n_cols":2,"rows_kept":4,"cut":false,"hidden":false,"merged":[[0,0,0,1],[1,0,1,1],[18,0,18,1]]}
[{"$f":"\"План здания \"&Наименование_Подразделения&\" \"&Изначальность&\" Изначальности, \"&Территория","v":"План здания Иерархии ИВО ИВДИВО 255 Изначальности, Санкт-Петербург"}]
["В плане здания распределены только Полномочные ИВДИВО. Сотрудники, Посвящённые и Праведники приписаны к Полномочным и составляют их группы явления в Залах."]
[]
["План 256-129 этажей:","План 128-1 этажей:"]

{"sheet":"справочники","index":4,"n_rows":274,"n_cols":16,"rows_kept":274,"cut":false,"hidden":false,"merged":[]}
["№ Изн","территория","территории","Отделения","Ипостась Изначального…(кто)","Ипостась Основы …(кто)","ИС","ИС","ИС","Название подразделения","Название подразделения в родительном падеже","ИВладыки","ИВладыки","Вид подразделения",{"$f":"\"Контакты Полномочных подразделения \"&Наименование_Подразделения&\" \"&Изначальность&\" Изначальности\"&\", \"&Территория","v":"Контакты Полномочных подразделения Иерархии ИВО ИВДИВО 255 Изначальности, Санкт-Петербург"}]
[256,"Москва","Москвы","Р","Изначального Отца","Изначального Отца","ИВДИВО",null,null,"ИВДИВО","ИВДИВО","Кут Хуми   ","Кут Хуми","1 Состав: 16 Служащих",0]
[255,"Санкт-Петербург","Санкт-Петербурга","Р","Изначальной Матери","Изначальной Матери","Иерархия ИВО",null,null,"Иерархия ИВО ИВДИВО","Иерархии ИВО ИВДИВО","Иосиф","Иосифа","2 Состав: 27 Служащих",null,"Наименование подразделения в родительном падеже:"]
[254,"Новосибирск","Новосибирска","Р","Изначального Сына","Изначального Сына","Цивилизация ИВО",null,null,"Цивилизация ИВО ИВДИВО","Цивилизации ИВО ИВДИВО","Мория","Мории","3 Состав: 33 Служащих",null,"Управление Синтеза"]
[253,"Крым","Крыма","Р","Изначальной Дочери","Изначальной Дочери","Психодинамика ИВО",null,null,"Психодинамика ИВО ИВДИВО","Психодинамики ИВО ИВДИВО","Филипп","Филиппа","4 Состав: 40 Служащих",null,"Территория (именительный падеж):"]
[252,"Краснодар","Краснодара","Р","Изначального Аватара","Изначального Аватара","Человек ИВО",null,null,"Человек ИВО ИВДИВО","Человека ИВО ИВДИВО","Византий","Византия","5 Состав: 50 Служащих",null,"Территория (родительный падеж):"]
[251,"Красноярск","Красноярска","Р","Изначального Майтрейи","Изначального Майтрейи","Конфедерация ИВО",null,null,"Конфедерация ИВО ИВДИВО","Конфедерации ИВО ИВДИВО","Янов","Янова","6 Состав: 60 Служащих",null,"Владыка"]
[250,"Екатеринбург","Екатеринбурга","Р","Изначального Христа","Изначального Христа","Теофа ИВО",null,null,"Теофа ИВО ИВДИВО","Теофы ИВО ИВДИВО","Юлий","Юлия","7 Состав: 68 Служащих",null,"Владычица"]
[249,"Московия","Московии","Р","Изначального Будды","Изначального Будды","Изначальная Метагалактика ИВО",null,null,"Изначальная Метагалактика ИВО ИВДИВО","Изначальний Метагалактики ИВО ИВДИВО","Юсеф ","Юсефа","8 Состав: 76 Служащих"]
[248,"Иркутск","Иркутска","Р","Изначального Владыки","Изначального Владыки","ИВДИВО Полномочного",null,null,"ИВДИВО Полномочного","ИВДИВО Полномочного","Владомир  ","Владомира","9 Состав: 84 Служащих"]
[247,"Сочи","Сочи","Р","Изначального Учителя","Изначального Учителя","Статусы ИВО ИВДИВО",null,null,"Статусы ИВО ИВДИВО","Статусов ИВО ИВДИВО","Савва         ","Саввы","10 Состав: 92 Служащих"]
[246,"Ставрополь","Ставрополя","Р","Изначального Логоса","Изначального Логоса","Посвящения ИВО",null,null,"Посвящения ИВО ИВДИВО","Посвящений ИВО ИВДИВО","Савелий     ","Савелия","11 Состав: 100 Служащих"]
[245,"Самара","Самары","Р","Изначального Аспекта","Изначального Аспекта","Технологии ИВО",null,null,"Технологии ИВО ИВДИВО","Технологий ИВО ИВДИВО","Вильгельм ","Вильгельма","12 Состав: 108 Служащих"]
[244,"Ростов-на-Дону","Ростова-на-Дону","Р","Изначальной Ипостаси","Изначальной Ипостаси","Изначальности ИВО",null,null,"Изначальности ИВО ИВДИВО","Изначальностей ИВО ИВДИВО","Юстас        ","Юстаса","13 Состав: 116 Служащих"]
[243,"Челны","Челнов","Р","Изначального Служащего","Изначального Служащего","Присутствия ИВО",null,null,"Присутствия ИВО ИВДИВО","Присутствий ИВО ИВДИВО","Александр ","Александра","14 Состав: 128 Служащих"]
[242,"Кавминводы","Кавминвод","Р","Изначального Посвящённого","Изначального Посвящённого","Миры ИВО",null,null,"Миры ИВО ИВДИВО","Миров ИВО ИВДИВО","Яромир       ","Яромира",null,null,{"$f":"\"Будда, Ипостась Изначально Вышестоящего Отца, Глава \"&Наименование_Подразделения&\" \"&Изначальность&\" Изначальности, Управления Синтеза \"&IFERROR(INDEX(ИВладыки_родит_падеж,O16),\"ошибка\")","v":"Будда, Ипостась Изначально Вышестоящего Отца, Глава Иерархии ИВО ИВДИВО 255 Изначальности, Управления Синтеза Яромира"}]
[241,"Казань","Казани","Р","Изначального Праведника","Изначального Праведника","Метагалактика ИВО",null,null,"Метагалактика ИВО ИВДИВО","Метагалактики ИВО ИВДИВО","Серапис      ","Сераписа",null,null,{"$f":"\"Владыка, Ипостась \"&IFERROR(INDEX(Ипостась_Изначального_,257-Изначальность),\"ошибка\")&\", Глава Высшей Школы Синтеза ИДИВО \"&Изначальность&\" Изначальности, Управления Синтеза \"&IFERROR(INDEX(ИВладыки_родит_падеж,O17),\"ошибка\")","v":"Владыка, Ипостась Изначальной Матери, Глава Высшей Школы Синтеза ИДИВО 255 Изначальности, Управления Синтеза Сераписа"}]
[240,"Севастополь","Севастополя","Р","Изначального Неизречённого","Изначального Неизречённого","Синтез ИВДИВО Изначального Неизречённого",null,null,"Синтез ИВДИВО Изначального Неизречённого","Синтеза ИВДИВО Изначального Неизречённого","Эдуард        ","Эдуарда",null,null,{"$f":"\"Владычица, Ипостась Основы \"&IFERROR(INDEX(Ипостась_Основы_,257-Изначальность),\"ошибка\")&\", Глава Метагалактической Академии Наук \"&Территории&\", Управления Синтеза \"&IFERROR(INDEX(ИВладыки_родит_падеж,O18),\"ошибка\")","v":"Владычица, Ипостась Основы Изначальной Матери, Глава Метагалактической Академии Наук Санкт-Петербурга, Управления Синтеза Эдуарда"}]
[239,"Балтия","Балтии","Р","Изначального Предвечного","Изначального Предвечного","Синтез Изначального Предвечного ИВО",null,null,"Синтез Изначального Предвечного ИВО ИВДИВО","Синтеза Изначального Предвечного ИВО ИВДИВО","Фадей          ","Фадея",null,null,{"$f":"\"Учитель, Ипостась Синтеза Кут Хуми, Глава Дома Статусного Синтеза \"&Территории&\", Управления Синтеза \"&IFERROR(INDEX(ИВладыки_родит_падеж,O19),\"ошибка\")","v":"Учитель, Ипостась Синтеза Кут Хуми, Глава Дома Статусного Синтеза Санкт-Петербурга, Управления Синтеза Фадея"}]
[238,"Бородино","Бородино","М","Изначального Всемогущего","Изначального Всемогущего","Синтез Изначального Всемогущего ИВО",null,null,"Синтез Изначального Всемогущего ИВО ИВДИВО","Синтеза Изначального Всемогущего ИВО ИВДИВО","Серафим     ","Серафима",null,null,{"$f":"\"Учитель, Ипостась Синтеза Фаинь, Глава Дома Посвящений \"&Территории&\", Управления Синтеза \"&IFERROR(INDEX(ИВладыки_родит_падеж,O20),\"ошибка\")","v":"Учитель, Ипостась Синтеза Фаинь, Глава Дома Посвящений Санкт-Петербурга, Управления Синтеза Серафима"}]
{"$rows_left_out":254}